جوشکاری قوسی
preferred label: arc welding @en
type: Concept
narrower: جوشکاری قوسی زیرپودری

جوشکاری قوسی زیرپودری
scope note: نوعی جوشکاری قوسی بدون اعمال فشار که در آن بین فلز پرکننده و حوضچۀ جوش یک یا چند قوس،‌ کنار هم یا پشت سر هم، ایجاد می‌شود؛ در این فرایند حفاظت از قوس و فلز مذاب با استفاده از لایه‌ای از پودر دانه‌ای انجام می‌شود.
broader: جوشکاری قوسی
preferred label: submerged arc welding @en
type: Concept