deuteron-nucleus reaction
alternative label: deuteron reaction
scope note: for inelastic deuteron-nucleus scattering, see "deuteron-nucleus scattering"
related: nuclear fusion
broader: nuclear reaction and scattering
preferred label: واکنش دوترون-هسته @fa
type: Concept

nuclear fusion
preferred label: گداخت هسته‌ای @fa
type: Concept
related: deuteron-nucleus reaction

nuclear reaction and scattering
preferred label: پراکندگی و واکنش هسته‌ای @fa
type: Concept
narrower: deuteron-nucleus reaction