خط انتقال متوازن
scope note: خط انتقالی که در آن هریک از رساناها نسبت به زمین پاگیری‌ها/ امپدانس‌های (impedances) یکسان دارد.
broader: خط انتقال
preferred label: balanced transmission line @en
type: Concept

خط انتقال
preferred label: transmission line @en
type: Concept
narrower: خط انتقال متوازن