ternary semiconductor
alternative label: II-IV-V2 semiconductor
scope note: for pseudobinary semiconductor, see "II-VI semiconductor", "III-V semiconductor", "III-VI semiconductor", "IV-VI semiconductor" and "semiconductor materials"
related: chalcogenide glass
broader: semiconductor materials
preferred label: نیم‌رسانای سه‌تایی @fa
type: Concept

chalcogenide glass
preferred label: شیشه کالکوژناید @fa
type: Concept
related: ternary semiconductor

semiconductor materials
preferred label: مواد نیم‌رسانا @fa
type: Concept
narrower: ternary semiconductor