لاک
preferred label: lacquer @en
type: Concept
narrower: لاک طلایی

لاک طلایی
scope note: لاکی که در صورت زدن آن بر برگچه‌های آلومینیمی، جلوه‌ای طلاگون به آنها می‌دهد.
broader: لاک
preferred label: golden lacquer @en
type: Concept