ردیاب
preferred label: tracer @en
type: Concept
narrower: ردیاب ایزوتوپی

ردیاب ایزوتوپی
scope note: ایزوتوپی از یک عنصر پرتوزا یا پایدار که برای بررسی تغییرات سامانۀ مورد نظر به آن افزوده می‌شود.
broader: ردیاب
preferred label: isotopic tracer @en
type: Concept