عارضه‌نگاری (زمین)
preferred label: topography (Earth) @en
type: Concept
narrower: عارضه‌نگاری سطح دریا

عارضه‌نگاری سطح دریا
scope note: نقشه‌برداری عوارض سطح اقیانوس در یک منطقه
broader: عارضه‌نگاری (زمین)
preferred label: sea surface topography @en
type: Concept