برش‌نگاری شکستی
scope note: نوعی برش‌نگاری بر پایۀ داده‌های لرزه‌ای شکستِ مرزی سطح‌به‌سطح
broader: برش‌نگاری
preferred label: refraction tomography @en
type: Concept

برش‌نگاری
preferred label: tomography @en
type: Concept
narrower: برش‌نگاری شکستی