سحابی پخشیده
preferred label: diffuse nebula @en
type: Concept
narrower: سحابی پخشیده روشن

سحابی پخشیده روشن
scope note: سحابی پخشیده‌ای که به ‌سبب نزدیکی به ستاره‌های اطراف درخشان دیده می‌شود.
broader: سحابی پخشیده
preferred label: bright diffuse nebula @en
type: Concept