بانکداری الکترونیکی
alternative label: virtual bank @en
alternative label: بانک مجازی
scope note: نوعی بانکداری که در آن مشتری تراکنش خود را ازطریق شبکۀ اینترنت انجام می‌دهد.
related: اینترنت
broader: بانکداری
preferred label: electronic banking @en
type: Concept

اینترنت
preferred label: Internet @en
type: Concept
related: بانکداری الکترونیکی

بانکداری
preferred label: banking @en
type: Concept
narrower: بانکداری الکترونیکی