تقلب
preferred label: fraud @en
type: Concept
narrower: تقلب رایانه‌ای

تقلب رایانه‌ای
scope note: هرنوع دستکاری در سامانه‌های رایانه‌ای برای سوءاستفاده یا فریبکاری
broader: تقلب
preferred label: computer fraud @en
type: Concept