نهان‌نگاری
preferred label: steganography @en
type: Concept
narrower: نهان‌نگاری نظریه‌اطلاعاتی‌امن

نهان‌نگاری نظریه‌اطلاعاتی‌امن
scope note: نوعی نهان‌نگاری که در آن امنیت سامانه‌ها در صورت تأمین یکی از ویژگی‌های کاملاًامن یا آماری‌امن برقرار می‌شود.
broader: نهان‌نگاری
preferred label: information-theoretically secure steganography @en
type: Concept