نهان‌نگاری آماری‌امن
scope note: نوعی خوارزمی/ الگوریتمی نهان‌نگاری که مهاجم با قدرت محاسباتی نامحدود تنها بتواند در آن تمایز ناچیزی بین پوشانه و نهانه پیدا کند.
broader: نهان‌نگاری
preferred label: statistically secure steganography @en
type: Concept

نهان‌نگاری
preferred label: steganography @en
type: Concept
narrower: نهان‌نگاری آماری‌امن