تردش قلیایی
scope note: شکست فلزات در محلول‌های قلیایی به‌موجب تأثیر هم‌زمـان خوردگی و تنش کششی
broader: تردش
preferred label: caustic embrittlement @en
type: Concept

تردش
preferred label: embrittlement @en
type: Concept
narrower: تردش قلیایی