گرفت
preferred label: eclipse @en
type: Concept
narrower: گرفت جزئی

گرفت جزئی
scope note: گرفتی که در آن ماه یا خورشید به‌طور کامل پوشانده نشود.
broader: گرفت
preferred label: partial eclipse @en
type: Concept