فرهنگ
preferred label: dictionary @en
type: Concept
narrower: فرهنگ دوسویه

فرهنگ دوسویه
scope note: گونه‌ای فرهنگ لغت دوزبانه که در آن، از دو سو، برابرهای واژه‌ها به دو زبان ارائه شده است.
broader: فرهنگ
preferred label: bidirectional dictionary @en
type: Concept