فرهنگ دوزبانه
alternative label: واژه‌نامه دوزبانه
scope note: فرهنگ یا واژه‌نامه‌ای که به دو زبان نوشته شده باشد.
broader: فرهنگ
preferred label: bilingual dictionary @en
type: Concept

فرهنگ
preferred label: dictionary @en
type: Concept
narrower: فرهنگ دوزبانه