ورق پردازشی فلزی
preferred label: sheet metal processing @en
type: Concept
related: برش‌زنی

برش‌زنی
scope note: بریدن قطعات با استفاده از دو لبۀ بُرندۀ مخالف هم، مانند قیچی
related: ورق پردازشی فلزی
broader: برشکاری
preferred label: shearing @en
type: Concept

برشکاری
preferred label: cutting @en
type: Concept
narrower: برش‌زنی