واپایش نوفه فعال
preferred label: active noise control @en
type: Concept
broader: واپایش نوفه

واپایش متغیرهای آکوستیکی
preferred label: acoustic variables control @en
type: Concept
narrower: واپایش نوفه

واپایش نوفه
alternative label: کنترل نوفه
scope note: فرایندی که نوفه را در محل تولید یا دریافت آن به سطح قابل‌قبول می‌رساند. @en
narrower: واپایش نوفه فعال
broader: واپایش متغیرهای آکوستیکی
preferred label: noise control @en
type: Concept