واپایشگر
preferred label: controller @en
type: Concept
narrower: واپایشگر خانک

واپایشگر خانک
scope note: واحدی رادیویی در شبکۀ ارتباطات سیار که مدیریت مسیرهای رادیویی موجود در هر خانک را بر عهده دارد.
broader: واپایشگر
preferred label: cell-site controller @en
type: Concept