پایدارساز ساحلی
scope note: هرنوع سازه که برای حفاظت از ساحل یا ممانعت از حرکت شن و ماسه در امتداد ساحل ساخته میشود.
broader: واپایشگر
preferred label: hard stabilisation @en
type: Concept

واپایشگر
preferred label: controller @en
type: Concept
narrower: پایدارساز ساحلی