ماهواره رله رادیویی
scope note: ماهواره‌ای که نشانک‌ها/ سیگنال‌های ایستگاه فرستندۀ دیگری، اعم از ماهواره‌ای یا زمینی را دریافت کند و دوباره انتقال دهد.
broader: رله رادیویی
preferred label: radio relay satellite @en
type: Concept

رله رادیویی
preferred label: radio relay @en
type: Concept
narrower: ماهواره رله رادیویی