ثابت
preferred label: constant @en
type: Concept
narrower: ثابت ناهمسانگردی

ثابت ناهمسانگردی
scope note: پارامتری وابسته ‌به‌ دما در مادۀ فرّومغناطیسی که بیانگر رابطۀ مغناطش در جهت‌های مختلف و انرژی ناهمسانگردی است.
broader: ثابت
preferred label: anisotropy constant @en
type: Concept