ثابت
preferred label: constant @en
type: Concept
narrower: ثابت کیهان‌شناختی

ثابت کیهان‌شناختی
scope note: ضریب جملۀ رانشی در معادله‌های میدان گرانش نسبیتی که این رانش را با ربایش گرانشی به ترازمندی می‌رساند.
broader: ثابت
preferred label: cosmological constant @en
type: Concept