ثابت تعادل
preferred label: equilibrium constant @en
type: Concept
narrower: ثابت خودپروتون‌کافت

ثابت خودپروتون‌کافت
scope note: حاصل‌ضرب فعالیت‌ها یا به تقریب غلظت‌های گونه‌های حاصل از یک واکنش خودپروتون‌کافت یا ثابت تعادل واکنش خودپروتون‌کافت
broader: ثابت تعادل
preferred label: autoprotolysis constant @en
type: Concept