ثابت ساختار ریز
preferred label: fine-structure constant @en
type: Concept
broader: ثابت بنیادی

ثابت
preferred label: constant @en
type: Concept
narrower: ثابت بنیادی

ثابت بنیادی
scope note: هریک از ثابت‌های فیزیکی که زاییدۀ نظریه‌های بنیادی فیزیک‌اند و به‌طور تجربی تعیین می‌شوند.
narrower: ثابت ساختار ریز
broader: ثابت
preferred label: fundamental constant @en
type: Concept