ثابت
preferred label: constant @en
type: Concept
narrower: ثابت رطوبت‌سنجشی

ثابت رطوبت‌سنجشی
alternative label: ثابت رطوبت‌سنجی
scope note: نسبت گرمای ویژۀ (Cp) هوای مرطوب در فشار ثابت به گرمای نهان (Lv) تبخیر آب
broader: ثابت
preferred label: psychrometric constant @en
type: Concept