ثابت
preferred label: constant @en
type: Concept
narrower: ثابت توری فراصوتی

ثابت توری فراصوتی
scope note: فاصلۀ بین گره‌های متوالی در امواج فراصوتی ایستاده که همانند توری اپتیکی عمل می‌کند.
broader: ثابت
preferred label: ultrasonic grating constant @en
type: Concept