رسانای یونی تند
scope note: جسم جامدی که رسانندگی یونی آن چندصد برابر رسانندگی عادی است.
broader: رسانا (الکتریکی)
preferred label: superionic conductor @en
type: Concept

رسانا (الکتریکی)
preferred label: conductor (electric) @en
type: Concept
narrower: رسانای یونی تند