زیرموشی
scope note: صفحه‌ای که موشی رایانه بر روی آن حرکت داده شود.
broader: موشی (رایانه)
preferred label: mouse pad @en
type: Concept

موشی (رایانه)
preferred label: mouse controller (computer) @en
type: Concept
narrower: زیرموشی