ink jet printer
alternative label: bubble jet printer
scope note: چاپگری که با پرتاب ذرات جوهر بر کاغذ نقش ایجاد کند. @fa
broader: printer
preferred label: چاپگر جوهرافشان @fa
type: Concept

printer
preferred label: چاپگر @fa
type: Concept
narrower: ink jet printer