چاپگر ماتریسی
preferred label: matrix printer @en
type: Concept
narrower: چاپگر سوزنی

چاپگر سوزنی
alternative label: چاپگر با ماتریس نقطه‌ای
scope note: چاپگری که در آن حرف یا نماد، ماتریسی از نقاط است و بر این نقاط مرکب افشانده یا ضربۀ همراه با مرکب وارد شود.
broader: چاپگر ماتریسی
preferred label: dot matrix printer @en
type: Concept