واسط رایانه‌ای
preferred label: computer interface @en
type: Concept
narrower: واسط برنامه‌سازی کاربردی

واسط برنامه‌سازی کاربردی
alternative label: میانای برنامه‌سازی کاربردی
scope note: مجموعه‌ای از اشیا که به برنامۀ کاربردی امکان می‌دهد با منابعی مانند سامانۀ عامل یا پرونده یا برنامۀ کاربردی دیگری ارتباط برقرار کند.
broader: واسط رایانه‌ای
preferred label: application programming interface @en
type: Concept