واسط کاربرپسند
alternative label: میانای کاربرپسند
scope note: نوعی میانا که کار کردن با آن برای کاربر بسیار آسان و جاذب باشد متـ . میانای کاربرپسند
broader: واسط کاربر
preferred label: user-friendly interface @en
type: Concept

واسط کاربر
preferred label: user interface @en
type: Concept
narrower: واسط کاربرپسند