رایانش احساسات
scope note: فنّاوری شناسایی و ضبط و تفسیر و پردازش و شبیه‌سازی احساسات مختلف انسان ازطریق سامانه‌ها و فنون و افزاره‌های خاص
broader: رایانش علوم رفتاری
preferred label: affective computing @en
type: Concept

رایانش علوم رفتاری
preferred label: behavioural sciences computing @en
type: Concept
narrower: رایانش احساسات