مهندسی نرم‌افزار با رایانه
scope note: استفاده از رایانه در طراحی و تولید نرم‌افزار
broader: رایانش مهندسی
preferred label: computer-aided software engineering @en
type: Concept

رایانش مهندسی
preferred label: engineering computing @en
type: Concept
narrower: مهندسی نرم‌افزار با رایانه