نمایه‌سازی تصویر
scope note: روشی برای بازیابی یک تصویر از یک مجموعه‌تصویر
broader: نمایه‌سازی
preferred label: image indexing @en
type: Concept

نمایه‌سازی
preferred label: indexing @en
type: Concept
narrower: نمایه‌سازی تصویر