واژگان فعال
scope note: مجموع واژه‌هایی که گویشوران یک زبان در سخن گفتن و نوشتن به کار می‌برند.
broader: واژگان
preferred label: active vocabulary @en
type: Concept

واژگان
preferred label: vocabulary @en
type: Concept
narrower: واژگان فعال