واژگان
preferred label: vocabulary @en
type: Concept
narrower: واژگان پایه

واژگان پایه
scope note: مجموعه‌ای کمینه و بنیادی از واژه‌های یک زبان که دانستن آنها برای ایجاد ارتباط با آن زبان ضروری است و به شیوه‌های مختلف ازجمله شمارش بسامدِ وقوع شناسایی می‌شود.
broader: واژگان
preferred label: basic vocabulary @en
type: Concept