مرکز اطلاعات
preferred label: information centre @en
type: Concept
narrower: پخشگاه اطلاعات

پخشگاه اطلاعات
scope note: واحدی در درون یک نهاد که به گردآوری و سازمان‌دهی و ذخیره‌سازی و اشاعۀ مدارک در یک حوزه یا رشتۀ تخصصی می‌پردازد.
broader: مرکز اطلاعات
preferred label: information clearing house @en
type: Concept