بازیابی تصویر
preferred label: image retrieval @en
type: Concept
narrower: پرسمان تصویری

پرسمان تصویری
scope note: پرس‌وجو برای یافتن اشیای مرتبط در پایگاه دادۀ تصویری
broader: بازیابی تصویر
preferred label: image querying @en
type: Concept