کتابخانه
preferred label: library @en
type: Concept
narrower: کتابخانه مرجع

کتابخانه مرجع
scope note: کتابخانه‌ای شامل منابع مرجع که منابع آن فقط در محل قابل استفاده است.
broader: کتابخانه
preferred label: reference library @en
type: Concept