رایانه کیفی
scope note: رایانه‌ای سبک و کوچک که به‌منظور حمل آسان و قرار دادن روی زانو طراحی شده باشد.
related: رایانه کتابی
broader: رایانه قابل حمل
preferred label: laptop computer @en
type: Concept

رایانه کتابی
preferred label: notebook computer @en
type: Concept
related: رایانه کیفی

رایانه قابل حمل
preferred label: portable computer @en
type: Concept
narrower: رایانه کیفی