رایانک
alternative label: رایانه لوحی
scope note: افزارۀ رایانشی دستی و مجهز به نمایشگر لمسی که در آن نمایشگر نقش صفحۀ نوشتن یا ترسیم را هم ایفا می‌کند.
broader: رایانه قابل حمل
preferred label: tablet computer @en
type: Concept

رایانه قابل حمل
preferred label: portable computer @en
type: Concept
narrower: رایانک