فشرده‌ساز ابرصوتی
preferred label: supersonic compressor @en
type: Concept
broader: فشرده‌ساز محوری

فشرده‌ساز
preferred label: compressor @en
type: Concept
narrower: فشرده‌ساز محوری

فشرده‌ساز محوری
scope note: نوعی فشرده‌ساز در موتورهای توربین گازی که هوا در آن مستقیم و موازی با محور فشرده‌ساز عبور می‌کند.
narrower: فشرده‌ساز ابرصوتی
broader: فشرده‌ساز
preferred label: axial flow compressor @en
type: Concept