جابه‌جایی
preferred label: commutation @en
type: Concept
narrower: قاعده جابه‌جایی

قاعده جابه‌جایی
scope note: رابطۀ بین دو عملگر جابه‌جایی‌ناپذیر در مکانیک کوانتومی که ارتباط میان ترتیب حاصل‌ِضرب عملگرها را نشان می‌دهد.
broader: جابه‌جایی
preferred label: commutation rule @en
type: Concept