دنباله‌دار بلنددوره
scope note: دنباله‌داری که دورۀ مداری آن بیش از دویست سال باشد.
broader: ستاره دنباله‌دار
preferred label: long-period comet @en
type: Concept

ستاره دنباله‌دار
preferred label: comet @en
type: Concept
narrower: دنباله‌دار بلنددوره