سیم‌لوله
preferred label: solenoid @en
type: Concept
narrower: پیچه توازن

پیچه توازن
scope note: سیم‌لوله‌ای با هستۀ آهنی و پیچ‌های قابل‌تنظیم برای تبدیل مدار دوسیمی به مدار سه‌سیمی
broader: سیم‌لوله
preferred label: balance coil @en
type: Concept