لعاب
preferred label: glaze @en
type: Concept
narrower: لعاب فریت‌شده

لعاب فریت‌شده
scope note: لعابی که در تهیۀ آن فریت‌سازی صورت گرفته است.
broader: لعاب
preferred label: fritted glaze @en
type: Concept