لعاب
preferred label: glaze @en
type: Concept
narrower: لعاب خام

لعاب خام
scope note: لعابی که هیچ‌یک از اجزای تشکیل‌دهندۀ آن پیش‌تر ذوب نشده باشد.
broader: لعاب
preferred label: raw glaze @en
type: Concept